Target
Genome polyprotein
Ligand
BDBM46667
Substrate
Meas. Tech.
EMSA
pH
7.5±n/a
Temperature
296.15±n/a K
IC50
1.9e+3± 7e+2 nM
Comments
extracted
Citation
 Mukherjee, SWeiner, WSSchroeder, CESimpson, DSHanson, AMSweeney, NLMarvin, RKNdjomou, JKolli, RIsailovic, DSchoenen, FJFrick, DN Ebselen Inhibits Hepatitis C Virus NS3 Helicase Binding to Nucleic Acid and Prevents Viral Replication ACS Chem Biol 9:2393-2403 (2014)  
Target
Name:
Genome polyprotein
Synonyms:
NS3
Type:
Enzyme Catalytic Domain
Mol. Mass.:
67067.41
Organism:
Hepatitis C virus
Description:
gi_125541954
Residue:
631
  
Inhibitor
Name:
BDBM46667
Synonyms:
2-phenyl-1,2-benzothiazol-3-one MLS-0107957.0001 cid_164981
Type:
Small organic molecule
Emp. Form.:
C13H9NOS
Mol. Mass.:
227.282
SMILES:
O=c1n(sc2ccccc12)-c1ccccc1
: