Target
Glucagon receptor
Ligand
BDBM123537
Substrate
Meas. Tech.
Binding Assay
pH
7.4±n/a
Ki
26.1±n/a nM
Citation
 Chakravarty, DKreutter, KPowell, MShook, BSong, FXu, GYang, SZhang, RZhao, B Picolinamido-propanoic acid derivatives useful as glucagon receptor antagonists US Patent  US8748624 Publication Date 6/10/2014 
Target
Name:
Glucagon receptor
Synonyms:
GCGR GLR_HUMAN Glucagon receptor (GlucR)
Type:
Enzyme
Mol. Mass.:
54026.92
Organism:
Homo sapiens (Human)
Description:
P47871
Residue:
477
  
Inhibitor
Name:
BDBM123537
Synonyms:
US8748624, 23
Type:
Small organic molecule
Emp. Form.:
C29H22ClF4N3O3
Mol. Mass.:
571.95
SMILES:
OC(=O)CCNC(=O)c1ccc(cn1)-c1cc(ccc1CNc1ccc(cc1)-c1ccc(F)cc1Cl)C(F)(F)F
: