Target
Glucagon receptor
Ligand
BDBM123600
Substrate
Meas. Tech.
Binding Assay
pH
7.4±n/a
Ki
22.9±n/a nM
Citation
 Chakravarty, DKreutter, KPowell, MShook, BSong, FXu, GYang, SZhang, RZhao, B Picolinamido-propanoic acid derivatives useful as glucagon receptor antagonists US Patent  US8748624 Publication Date 6/10/2014 
Target
Name:
Glucagon receptor
Synonyms:
GCGR GLR_HUMAN Glucagon receptor (GlucR)
Type:
Enzyme
Mol. Mass.:
54026.92
Organism:
Homo sapiens (Human)
Description:
P47871
Residue:
477
  
Inhibitor
Name:
BDBM123600
Synonyms:
US8748624, 103
Type:
Small organic molecule
Emp. Form.:
C28H21Cl2F2N3O3
Mol. Mass.:
556.387
SMILES:
OC(=O)CCNC(=O)c1ccc(cn1)-c1cc(F)c(F)cc1CNc1ccc(c(Cl)c1)-c1ccc(Cl)cc1
: