Target
D(3) dopamine receptor
Ligand
BDBM50219117
Substrate
Meas. Tech.
Binding Assay
Ki
0.6±n/a nM
IC50
1.0±n/a nM
Citation
 Newman, AHGrundt, PCyriac, GCLuedtke, RCao, J 4-phenylpiperazine derivatives with functionalized linkers as dopamine D3 receptor selective ligands and methods of use US Patent  US8748608 Publication Date 6/10/2014 
Target
Name:
D(3) dopamine receptor
Synonyms:
DOPAMINE D3 DRD3_HUMAN Dopamine D3 receptor (D3) Dopamine receptor Dopamine receptor D3
Type:
Mol. Mass.:
44243.43
Organism:
Homo sapiens (Human)
Description:
Residue:
400
  
Inhibitor
Name:
BDBM50219117
Synonyms:
CHEMBL244562 US8748608, 9
Type:
Small organic molecule
Emp. Form.:
C26H26Cl2N4O2
Mol. Mass.:
497.416
SMILES:
Clc1cccc(N2CCN(C\C=C\CNC(=O)c3ccc(cc3)-c3cccc(=O)[nH]3)CC2)c1Cl
: