Target
Poly [ADP-ribose] polymerase 1
Ligand
BDBM124962
Substrate
Meas. Tech.
Biochemical Assay
Kd
30±n/a nM
Citation
 Papeo, GMBusel, AACasale, EKhvat, AKrasavin, MYOrsini, PPosteri, HScolaro, A 3-oxo-2,3-dihydro-1H-isoindole-4-carboxamides with selective PARP-1 inhibition US Patent  US8765972 Publication Date 7/1/2014 
Target
Name:
Poly [ADP-ribose] polymerase 1
Synonyms:
(ARTD1 or PARP1) 2.4.2.30 ADPRT ARTD1 Human diphtheria toxin-like ADP-ribosyltransferase (ARTD1 or PARP1) NT-PARP-1 PARP1 PPOL Poly [ADP-ribose] polymerase 1 (PARP) Poly [ADP-ribose] polymerase 1 (PARP1) Poly [ADP-ribose] polymerase 1, 28-kDa form Poly [ADP-ribose] polymerase 1, processed C-terminus Poly [ADP-ribose] polymerase-1 Poly(ADP-ribose) polymerase-1 (ARTD1/PARP1) Protein poly-ADP-ribosyltransferase PARP1 | Synonyms=ADPRT
Type:
Mol. Mass.:
113114.22
Organism:
Homo sapiens (Human)
Description:
P09874
Residue:
1014
  
Inhibitor
Name:
BDBM124962
Synonyms:
US8765972, 21
Type:
Small organic molecule
Emp. Form.:
C22H31N3O2
Mol. Mass.:
369.5004
SMILES:
CC1N(C2CCN(CC3CCCCC3)CC2)C(=O)c2c1cccc2C(N)=O
: