Target
Sphingosine 1-phosphate receptor 1
Ligand
BDBM127534
Substrate
Meas. Tech.
Receptor Calcium FLIPR Antagonist Assay
Temperature
310.15±n/a K
IC50
0.8±n/a nM
Comments
extracted
Citation
 Angst, DBollbuck, BJanser, PQuancard, JStiefl, NJ Aryl benzylamine compounds US Patent  US8791100 Publication Date 7/29/2014 
Target
Name:
Sphingosine 1-phosphate receptor 1
Synonyms:
CHEDG1 Endothelial differentiation G-protein coupled receptor 1 S1P1 S1PR1_HUMAN Sphingosine 1-phosphate receptor Edg-1
Type:
Enzyme
Mol. Mass.:
42836.02
Organism:
Homo sapiens (Human)
Description:
P21453
Residue:
382
  
Inhibitor
Name:
BDBM127534
Synonyms:
US8791100, 32
Type:
Small organic molecule
Emp. Form.:
C24H31ClN2O2
Mol. Mass.:
414.968
SMILES:
CC[C@@H](Nc1ccc(C)c(CN2CC[C@H](C2)C(O)=O)c1C)c1ccc(Cl)c(C)c1
: