Target
Transthyretin
Ligand
BDBM128213
Substrate
Meas. Tech.
Luminescence-based cell-based high throughput dose response assay to identify activators of Transthyretin (TTR) transcription
EC50
>167158±n/a nM
Citation
 PubChem, PC Luminescence-based cell-based high throughput dose response assay to identify activators of Transthyretin (TTR) transcription PubChem Bioassay (2014)[AID] 
Target
Name:
Transthyretin
Synonyms:
ATTR Prealbumin TTHY_HUMAN Transthyretin (TTR)
Type:
Enzyme
Mol. Mass.:
15884.31
Organism:
Homo sapiens (Human)
Description:
P02766
Residue:
147
  
Inhibitor
Name:
BDBM128213
Synonyms:
MLS000545606 N-[(Z)-(1-ethyl-5-methyl-4-pyrazolyl)methylideneamino]-1-benzothiophene-3-carboxamide N-[(Z)-(1-ethyl-5-methyl-pyrazol-4-yl)methylideneamino]-1-benzothiophene-3-carboxamide SMR000159916 | cid_5412241
Type:
Small organic molecule
Emp. Form.:
C16H16N4OS
Mol. Mass.:
312.389
SMILES:
CCn1ncc(\C=N/NC(=O)c2csc3ccccc23)c1C
: