Target
DNA-dependent protein kinase catalytic subunit
Ligand
BDBM128743
Substrate
Meas. Tech.
Biochemical Assay
pH
7.4±n/a
Temperature
298.15±n/a K
IC50
<100±n/a nM
Comments
extracted
Citation
 Fuchss, TMederski, WZenke, F Pyrazoloquinolines US Patent  US8802712 Publication Date 8/12/2014 
Target
Name:
DNA-dependent protein kinase catalytic subunit
Synonyms:
DNA-PK catalytic subunit DNA-dependent protein kinase (DNA-PK) DNA-dependent protein kinase catalytic subunit (DNA-PK) HYRC PRKDC | PRKDC_HUMAN
Type:
Protein
Mol. Mass.:
469114.78
Organism:
Homo sapiens (Human)
Description:
P78527
Residue:
4128
  
Inhibitor
Name:
BDBM128743
Synonyms:
US8802712, 1
Type:
Small organic molecule
Emp. Form.:
C19H14N4O2
Mol. Mass.:
330.3401
SMILES:
COc1cc2ncc3[nH]nc(-c4ccc(cc4)C#N)c3c2cc1OC
: