Target
DNA-dependent protein kinase catalytic subunit
Ligand
BDBM128756
Substrate
Meas. Tech.
Biochemical Assay
pH
7.4±n/a
Temperature
298.15±n/a K
IC50
0.3±n/a nM
Comments
extracted
Citation
 Fuchss, TMederski, WZenke, F Pyrazoloquinolines US Patent  US8802712 Publication Date 8/12/2014 
Target
Name:
DNA-dependent protein kinase catalytic subunit
Synonyms:
DNA-PK catalytic subunit DNA-dependent protein kinase (DNA-PK) DNA-dependent protein kinase catalytic subunit (DNA-PK) HYRC PRKDC | PRKDC_HUMAN
Type:
Protein
Mol. Mass.:
469114.78
Organism:
Homo sapiens (Human)
Description:
P78527
Residue:
4128
  
Inhibitor
Name:
BDBM128756
Synonyms:
US8802712, 14
Type:
Small organic molecule
Emp. Form.:
C27H19N5O2
Mol. Mass.:
445.4721
SMILES:
COc1cc2ncc3n(C)nc(-c4ccc(cc4)C#N)c3c2cc1OCc1ccccc1C#N
: