Target
DNA-dependent protein kinase catalytic subunit
Ligand
BDBM128760
Substrate
Meas. Tech.
Biochemical Assay
pH
7.4±n/a
Temperature
298.15±n/a K
IC50
0.3±n/a nM
Comments
extracted
Citation
 Fuchss, TMederski, WZenke, F Pyrazoloquinolines US Patent  US8802712 Publication Date 8/12/2014 
Target
Name:
DNA-dependent protein kinase catalytic subunit
Synonyms:
DNA-PK catalytic subunit DNA-dependent protein kinase (DNA-PK) DNA-dependent protein kinase catalytic subunit (DNA-PK) HYRC PRKDC | PRKDC_HUMAN
Type:
Protein
Mol. Mass.:
469114.78
Organism:
Homo sapiens (Human)
Description:
P78527
Residue:
4128
  
Inhibitor
Name:
BDBM128760
Synonyms:
US8802712, 18
Type:
Small organic molecule
Emp. Form.:
C28H21FN4O4
Mol. Mass.:
496.4891
SMILES:
COC(=O)C(Oc1cc2c3c(nn(C)c3cnc2cc1OC)-c1ccc(cc1)C#N)c1ccc(F)cc1
: