Target
5-hydroxytryptamine receptor 2A
Ligand
BDBM50352724
Substrate
Meas. Tech.
Binding Assay
pH
7.4±n/a
IC50
18.6±n/a nM
Comments
extracted
Citation
 Lee, JSeo, HJKang, SYPark, EKim, MJLee, SHKim, JYKim, JJung, MEKim, HJKim, MHan, HKAhn, KWLee, MWLee, KPae, ANPark, W Arylpiperazine-containing imidazole 4-carboxamide derivatives and pharmaceutical composition comprising same US Patent  US8835436 Publication Date 9/16/2014 
Target
Name:
5-hydroxytryptamine receptor 2A
Synonyms:
5-HT-2 5-HT2A 5-hydroxytryptamine receptor 2A (5HT-2A) 5HT2A_HUMAN HTR2A | Serotonin receptor 2A
Type:
undefined
Mol. Mass.:
52607.65
Organism:
Homo sapiens (Human)
Description:
P28223
Residue:
471
  
Inhibitor
Name:
BDBM50352724
Synonyms:
CHEMBL1822896 | US8835436, Example 6
Type:
Small organic molecule
Emp. Form.:
C25H29Cl2N5O
Mol. Mass.:
486.437
SMILES:
Cc1nc(C(=O)NCCCN2CCN(CC2)c2cccc(Cl)c2Cl)c(C)n1-c1ccccc1
: