Target
Cannabinoid receptor 2
Ligand
BDBM133294
Substrate
Meas. Tech.
Radioligand Binding Assay
pH
7.4±n/a
Temperature
303.15±n/a K
Ki
1.3±n/a nM
Comments
extracted
Citation
 Carroll, WADart, MJFrost, JMKolasa, TLi, TLiu, BPerez-Medrano, APatel, MWang, XPeddi, S Compounds as cannabinoid receptor ligands US Patent  US8846730 Publication Date 9/30/2014 
Target
Name:
Cannabinoid receptor 2
Synonyms:
CANNABINOID CB2 CB2 CB2B CNR2_HUMAN Cannabinoid CB2 receptor Cannabinoid receptor 2 (CB2R) | hCB2
Type:
G Protein-Coupled Receptor (GPCR)
Mol. Mass.:
39690.94
Organism:
Homo sapiens (Human)
Description:
P34972
Residue:
360
  
Inhibitor
Name:
BDBM133294
Synonyms:
US8846730, 51
Type:
Small organic molecule
Emp. Form.:
C26H34F3N3O2S2
Mol. Mass.:
541.692
SMILES:
CN1CCC[C@H]1COc1ccc(cc1C(=S)\N=c1/sc(cn1C[C@H]1CCCO1)C(C)(C)C)C(F)(F)F
: