Target
Cytochrome P450 2B6
Ligand
BDBM12345
Substrate
Meas. Tech.
Inhibition Assay
pH
7.5±n/a
IC50
191000±n/a nM
Comments
extracted
Citation
 Cashman, JR Synthetic compounds and methods to decrease nicotine self-administration US Patent  US8906943 Publication Date 12/9/2014 
Target
Name:
Cytochrome P450 2B6
Synonyms:
CP2B6_HUMAN Cytochrome P450 2B6 (CYP2B6)
Type:
Protein
Mol. Mass.:
56289.75
Organism:
Homo sapiens (Human)
Description:
P20813
Residue:
491
  
Inhibitor
Name:
BDBM12345
Synonyms:
CHEMBL178090 US8609708, 47 nicotine 3-heteroaromatic analogue 2a
Type:
Small organic molecule
Emp. Form.:
C10H10N2O
Mol. Mass.:
174.1992
SMILES:
NCc1ccc(o1)-c1cccnc1
: