Target
Cytochrome P450 2B6
Ligand
BDBM12357
Substrate
Meas. Tech.
Inhibition Assay
pH
7.5±n/a
IC50
103000±n/a nM
Comments
extracted
Citation
 Cashman, JR Synthetic compounds and methods to decrease nicotine self-administration US Patent  US8906943 Publication Date 12/9/2014 
Target
Name:
Cytochrome P450 2B6
Synonyms:
CP2B6_HUMAN Cytochrome P450 2B6 (CYP2B6)
Type:
Protein
Mol. Mass.:
56289.75
Organism:
Homo sapiens (Human)
Description:
P20813
Residue:
491
  
Inhibitor
Name:
BDBM12357
Synonyms:
3-(1H-imidazol-4-yl)pyridine JMC514968 Compound 7 US8609708,14 | nicotine 3-heteroaromatic analogue 10
Type:
Small organic molecule
Emp. Form.:
C8H7N3
Mol. Mass.:
145.1613
SMILES:
c1nc(c[nH]1)-c1cccnc1
: