Target
Cytochrome P450 2B6
Ligand
BDBM50149352
Substrate
Meas. Tech.
Inhibition Assay
pH
7.5±n/a
IC50
11000±n/a nM
Comments
extracted
Citation
 Cashman, JR Synthetic compounds and methods to decrease nicotine self-administration US Patent  US8906943 Publication Date 12/9/2014 
Target
Name:
Cytochrome P450 2B6
Synonyms:
CP2B6_HUMAN Cytochrome P450 2B6 (CYP2B6)
Type:
Protein
Mol. Mass.:
56289.75
Organism:
Homo sapiens (Human)
Description:
P20813
Residue:
491
  
Inhibitor
Name:
BDBM50149352
Synonyms:
1-Cyclohexylmethyl-1H-imidazole | CHEMBL120057
Type:
Small organic molecule
Emp. Form.:
C10H16N2
Mol. Mass.:
164.2474
SMILES:
C(C1CCCCC1)n1ccnc1
: