Target
Tyrosine-protein kinase SYK
Ligand
BDBM140387
Substrate
Meas. Tech.
Kinase Assay
pH
7.5±n/a
Temperature
193.15±n/a K
IC50
1.2±n/a nM
Citation
 Hoffmann, MBischoff, DDahmann, GKlicic, JSchaenzle, GWollin, SLConvers-Reignier, SGEast, SPMarlin, FJMcCarthy, CScott, J Substituted quinolines and their use as medicaments US Patent  US8912173 Publication Date 12/16/2014 
Target
Name:
Tyrosine-protein kinase SYK
Synonyms:
KSYK_HUMAN Spleen Tyrosine Kinase Tyrosine-protein kinase SYK (Syk)
Type:
Enzyme
Mol. Mass.:
72079.99
Organism:
Homo sapiens (Human)
Description:
P43405
Residue:
635
  
Inhibitor
Name:
BDBM140387
Synonyms:
US10947243, Example 112 US9914735, Example 112
Type:
Small organic molecule
Emp. Form.:
C20H22N4O2
Mol. Mass.:
350.4143
SMILES:
C[C@@H](Oc1cc(cc2ncccc12)-c1cnn(C)c1C)[C@H]1CNC(=O)C1
: