Target
Arachidonate 5-lipoxygenase-activating protein
Ligand
BDBM145794
Substrate
Meas. Tech.
Homogeneous Time Resolved Fluorescence Assay
Ki
1.4±n/a nM
Citation
 Chai, WDvorak, CAEccles, WEdwards, JPGoldberg, SDKrawczuk, PJLebsack, ADLiu, JPippel, DJSales, ZSTanis, VMTichenor, MSWiener, JJ 1,2,6-substituted benzimidazoles as FLAP modulators US Patent  US8952177 Publication Date 2/10/2015 
Target
Name:
Arachidonate 5-lipoxygenase-activating protein
Synonyms:
5-lipoxygenase-activating protein (FLAP) ALOX5AP
Type:
Protein
Mol. Mass.:
24212.61
Organism:
Homo sapiens (Human)
Description:
A0A087WW23
Residue:
218
  
Inhibitor
Name:
BDBM145794
Synonyms:
US8952177, 150 US9695149, 150
Type:
Small organic molecule
Emp. Form.:
C33H31F3N4O3
Mol. Mass.:
588.6194
SMILES:
Cn1ccc(COc2ccc3nc([C@@H]4CCCC[C@@H]4C(O)=O)n(Cc4cccc(c4)-c4ccc(cc4)C(F)(F)F)c3c2)n1
: