Target
Glutaminyl-peptide cyclotransferase
Ligand
BDBM149363
Substrate
Meas. Tech.
Spectrophotometric Assay
Temperature
303.15±n/a K
Ki
3.8±n/a nM
IC50
234±n/a nM
Comments
extracted
Citation
 Heiser, USommer, RGaertner, UHamann, AAlmstetter, MThormann, MTreml, ADemuth, HHoffman, T Inhibitors of glutaminyl cyclase US Patent  US8962860 Publication Date 2/24/2015 
Target
Name:
Glutaminyl-peptide cyclotransferase
Synonyms:
Glutaminyl Cyclase Glutaminyl-peptide cyclotransferase Glutaminyl-tRNA cyclotransferase QPCT | QPCT_HUMAN
Type:
Enzyme
Mol. Mass.:
40877.05
Organism:
Homo sapiens (Human)
Description:
Q16769
Residue:
361
  
Inhibitor
Name:
BDBM149363
Synonyms:
US8962860, 6
Type:
Small organic molecule
Emp. Form.:
C19H18N4O3
Mol. Mass.:
350.3712
SMILES:
CCCOc1ccc(cc1)C1N(C(=O)NC1=O)c1ccc2[nH]cnc2c1
: