Target
Glutaminyl-peptide cyclotransferase
Ligand
BDBM149366
Substrate
Meas. Tech.
Spectrophotometric Assay
Temperature
303.15±n/a K
Ki
4.13±n/a nM
IC50
48±n/a nM
Comments
extracted
Citation
 Heiser, USommer, RGaertner, UHamann, AAlmstetter, MThormann, MTreml, ADemuth, HHoffman, T Inhibitors of glutaminyl cyclase US Patent  US8962860 Publication Date 2/24/2015 
Target
Name:
Glutaminyl-peptide cyclotransferase
Synonyms:
Glutaminyl Cyclase Glutaminyl-peptide cyclotransferase Glutaminyl-tRNA cyclotransferase QPCT | QPCT_HUMAN
Type:
Enzyme
Mol. Mass.:
40877.05
Organism:
Homo sapiens (Human)
Description:
Q16769
Residue:
361
  
Inhibitor
Name:
BDBM149366
Synonyms:
US8962860, 11
Type:
Small organic molecule
Emp. Form.:
C22H16N4O2
Mol. Mass.:
368.388
SMILES:
O=C1NC(=O)N(C1c1ccc(cc1)-c1ccccc1)c1ccc2[nH]cnc2c1
: