Target
Heat shock protein HSP 90-alpha
Ligand
BDBM152276
Substrate
Meas. Tech.
Biacore Assay
pH
7.6±n/a
Kd
3.2±n/a nM
Comments
extracted
Citation
 Brasca, MGCasale, EFerguson, RPolucci, PZuccotto, F Resorcinol derivatives as HSP90 inhibitors US Patent  US8993556 Publication Date 3/31/2015 
Target
Name:
Heat shock protein HSP 90-alpha
Synonyms:
HS90A_HUMAN HSP86 HSP90AA1 HSPCA Heat shock 86 kDa Heat shock protein HSP 90-alpha (HSP90) LAP-2 Lipopolysaccharide-associated protein 2 heat shock protein 90kDa alpha (cytosolic), class A member 1 isoform 2
Type:
Molecular Chaperone
Mol. Mass.:
84623.45
Organism:
Homo sapiens (Human)
Description:
P07900
Residue:
732
  
Inhibitor
Name:
BDBM152276
Synonyms:
US8993556, 5-[2,4-Dihydroxy-6-(4-nitrophenoxy)phenyl]-N-[1-(propan-2-yl)piperidin-4-yl]isoxazole-3-carboxamide
Type:
Small organic molecule
Emp. Form.:
C24H26N4O7
Mol. Mass.:
482.4858
SMILES:
CC(C)N1CCC(CC1)NC(=O)c1cc(on1)-c1c(O)cc(O)cc1Oc1ccc(cc1)[N+]([O-])=O
: