Target
Heat shock protein HSP 90-alpha
Ligand
BDBM152279
Substrate
Meas. Tech.
Biacore Assay
pH
7.6±n/a
Kd
0.043±n/a nM
Comments
extracted
Citation
 Brasca, MGCasale, EFerguson, RPolucci, PZuccotto, F Resorcinol derivatives as HSP90 inhibitors US Patent  US8993556 Publication Date 3/31/2015 
Target
Name:
Heat shock protein HSP 90-alpha
Synonyms:
HS90A_HUMAN HSP86 HSP90AA1 HSPCA Heat shock 86 kDa Heat shock protein HSP 90-alpha (HSP90) LAP-2 Lipopolysaccharide-associated protein 2 heat shock protein 90kDa alpha (cytosolic), class A member 1 isoform 2
Type:
Molecular Chaperone
Mol. Mass.:
84623.45
Organism:
Homo sapiens (Human)
Description:
P07900
Residue:
732
  
Inhibitor
Name:
BDBM152279
Synonyms:
US8993556, 3-{2-[4-(Dimethylamino)phenoxy]-4,6-dihydroxyphenyl}-N-[1-(1,4-dioxaspiro[4.5]dec-8-yl)piperidin-4-yl]isoxazole-5-carboxamide
Type:
Small organic molecule
Emp. Form.:
C31H38N4O7
Mol. Mass.:
578.656
SMILES:
CN(C)c1ccc(Oc2cc(O)cc(O)c2-c2cc(on2)C(=O)NC2CCN(CC2)C2CCC3(CC2)OCCO3)cc1
: