Target
Heat shock protein HSP 90-alpha
Ligand
BDBM152286
Substrate
Meas. Tech.
Biacore Assay
pH
7.6±n/a
Kd
0.24±n/a nM
Comments
extracted
Citation
 Brasca, MGCasale, EFerguson, RPolucci, PZuccotto, F Resorcinol derivatives as HSP90 inhibitors US Patent  US8993556 Publication Date 3/31/2015 
Target
Name:
Heat shock protein HSP 90-alpha
Synonyms:
HS90A_HUMAN HSP86 HSP90AA1 HSPCA Heat shock 86 kDa Heat shock protein HSP 90-alpha (HSP90) LAP-2 Lipopolysaccharide-associated protein 2 heat shock protein 90kDa alpha (cytosolic), class A member 1 isoform 2
Type:
Molecular Chaperone
Mol. Mass.:
84623.45
Organism:
Homo sapiens (Human)
Description:
P07900
Residue:
732
  
Inhibitor
Name:
BDBM152286
Synonyms:
US8993556, 3-[2,4-Dihydroxy-6-(4-nitrophenoxy)phenyl]-N-(1-methylpiperidin-4-yl)isoxazole-5-carboxamide
Type:
Small organic molecule
Emp. Form.:
C22H22N4O7
Mol. Mass.:
454.4327
SMILES:
CN1CCC(CC1)NC(=O)c1cc(no1)-c1c(O)cc(O)cc1Oc1ccc(cc1)[N+]([O-])=O
: