Target
Gag-Pol polyprotein [588-1127,Y768C]/[588-1147,Y768C]
Ligand
BDBM5026
Substrate
Poly(rC):oligo(dG )Template:Primer
Meas. Tech.
HIV-1 RT Assay
pH
8.4±n/a
Temperature
310.15±n/a K
IC50
66±n/a nM
Citation
 Masuda, NYamamoto, OFujii, MOhgami, TFujiyasu, JKontani, TMoritomo, AOrita, MKurihara, HKoga, HKageyama, SOhta, MInoue, HHatta, TShintani, MSuzuki, HSudo, KShimizu, YKodama, EMatsuoka, MFujiwara, MYokota, TShigeta, SBaba, M Studies of non-nucleoside HIV-1 reverse transcriptase inhibitors. Part 2: synthesis and structure-activity relationships of 2-cyano and 2-hydroxy thiazolidenebenzenesulfonamide derivatives. Bioorg Med Chem 13:949-61 (2005)  
Target
Name:
Gag-Pol polyprotein [588-1127,Y768C]/[588-1147,Y768C]
Synonyms:
EC: 2.7.7.49 | HIV-1 Reverse Transcriptase Mutant (Y181C)
Type:
Protein Complex
Mol. Mass.:
Description:
Components:
This complex has 2 components.
Component 1
Name:
Gag-Pol polyprotein [588-1147,Y768C]
Synonyms:
HIV-1 Reverse Transcriptase Mutant (Y181C) Chain A gag-pol
Type:
Enzyme Subunit
Mol. Mass.:
64426.38
Organism:
Human immunodeficiency virus type 1
Description:
P04585[588-1147,Y768C]
Residue:
560
  
Component 2
Name:
Gag-Pol polyprotein [588-1127,Y768C]
Synonyms:
HIV-1 Reverse Transcriptase Mutant (Y181C) Chain B gag-pol
Type:
Enzyme Subunit
Mol. Mass.:
51277.10
Organism:
Human immunodeficiency virus type 1
Description:
P04585[588-1127,Y768C]
Residue:
440
  
Inhibitor
Name:
BDBM5026
Synonyms:
3-substituted thiazolidene deriv. 17a thiazolidenebenzenesulfonamide deriv. 1
Type:
Small organic molecule
Emp. Form.:
C15H19N3O4S2
Mol. Mass.:
369.459
SMILES:
Cc1c(s\c(=N/S(=O)(=O)c2cccc(c2)[N+]([O-])=O)n1C)C(C)(C)C
:
Substrate
Name:
Poly(rC):oligo(dG )Template:Primer
Synonyms:
Type:
RNA /DNA Duplex
Mol. Mass.:
358.43
Organism:
Description:
The incorporation of Tritium-labeled [3H]dGTP onto a (poly)rC:(oligo)dG template:primer.
Residue:
3
NA