Target
D(3) dopamine receptor
Ligand
BDBM50130293
Substrate
Meas. Tech.
Receptor Assay
pH
7.4±n/a
IC50
37.9±n/a nM
Comments
extracted
Citation
 Zhang, GChen, YXu, XLiu, XZhao, SLiu, BYu, MQiu, Y Alicyclic[c] benzopyrone derivatives and uses thereof US Patent  US9018213 Publication Date 4/28/2015 
Target
Name:
D(3) dopamine receptor
Synonyms:
DOPAMINE D3 Dopamine D3 receptor | Drd3
Type:
Protein
Mol. Mass.:
49540.58
Organism:
Rattus norvegicus (Rat)
Description:
P19020
Residue:
446
  
Inhibitor
Name:
BDBM50130293
Synonyms:
7-{4-[4-(2,3-dichlorophenyl)piperazin-1-yl]butoxy}-3,4-dihydroquinolin-2(1H)-one CHEMBL1112 US10752588, Compound Aripiprazole US9018213, aripprazole | US9156822, Aripiprazole
Type:
Small organic molecule
Emp. Form.:
C23H27Cl2N3O2
Mol. Mass.:
448.385
SMILES:
Clc1cccc(N2CCN(CCCCOc3ccc4CCC(=O)Nc4c3)CC2)c1Cl
: