Target
E3 ubiquitin-protein ligase Mdm2
Ligand
BDBM47307
Substrate
Meas. Tech.
AlphaScreen Assay
Temperature
298.15±n/a K
IC50
18000±n/a nM
Comments
extracted
Citation
 Errico, JPMugrage, BTurchi, ISills, MOng, JAllocco, JWines, PBastos, M Combination therapy with MDM2 and EFGR inhibitors US Patent  US9023354 Publication Date 5/5/2015 
Target
Name:
E3 ubiquitin-protein ligase Mdm2
Synonyms:
Double minute 2 protein E3 ubiquitin-protein ligase Mdm2 (p53-binding protein Mdm2) Human Double Minute 2 (HDM2) MDM2-MDMX p53-Binding Protein MDM2 | p53-binding protein
Type:
Oncoprotein
Mol. Mass.:
55196.54
Organism:
Homo sapiens (Human)
Description:
Q00987
Residue:
491
  
Inhibitor
Name:
BDBM47307
Synonyms:
BDBM50339143 | US9023354, AD4-10942
Type:
Emp. Form.:
C22H16F3N3O
Mol. Mass.:
395.3771
SMILES:
Oc1c(ccc2cccnc12)C(Nc1cccnc1)c1ccc(cc1)C(F)(F)F
: