Target
E3 ubiquitin-protein ligase Mdm2
Ligand
BDBM156660
Substrate
Meas. Tech.
AlphaScreen Assay
Temperature
298.15±n/a K
IC50
2000±n/a nM
Comments
extracted
Citation
 Errico, JPMugrage, BTurchi, ISills, MOng, JAllocco, JWines, PBastos, M Combination therapy with MDM2 and EFGR inhibitors US Patent  US9023354 Publication Date 5/5/2015 
Target
Name:
E3 ubiquitin-protein ligase Mdm2
Synonyms:
Double minute 2 protein E3 ubiquitin-protein ligase Mdm2 (p53-binding protein Mdm2) Human Double Minute 2 (HDM2) MDM2-MDMX p53-Binding Protein MDM2 | p53-binding protein
Type:
Oncoprotein
Mol. Mass.:
55196.54
Organism:
Homo sapiens (Human)
Description:
Q00987
Residue:
491
  
Inhibitor
Name:
BDBM156660
Synonyms:
US9023354, AD4-10963
Type:
Small organic molecule
Emp. Form.:
C21H19N3OS
Mol. Mass.:
361.46
SMILES:
Cc1ccsc1C(Nc1cc(C)ccn1)c1ccc2cccnc2c1O
: