Target
Enteropeptidase
Ligand
BDBM158073
Substrate
Meas. Tech.
Inhibition Assay
pH
8±n/a
Ki
0.14±n/a nM
Comments
extracted
Citation
 Koshiba, TTokumasu, MIchimaru, TOhsumi, KNakagawa, TYamada, TMatsumoto, KSuzuki, T Heteroarylcarboxylic acid ester derivative US Patent  US9024044 Publication Date 5/5/2015 
Target
Name:
Enteropeptidase
Synonyms:
ENTK PRSS7 | TMPRSS15
Type:
Enzyme
Mol. Mass.:
112901.62
Organism:
Homo sapiens (Human)
Description:
P98073
Residue:
1019
  
Inhibitor
Name:
BDBM158073
Synonyms:
US9024044, 1 US9655879, 1
Type:
Small organic molecule
Emp. Form.:
C22H22FN3O7S
Mol. Mass.:
491.489
SMILES:
NC(=N)c1ccc(OC(=O)c2ccc(CC3(CCC3)C(=O)N[C@@H](CC(O)=O)C(O)=O)s2)c(F)c1
: