Target
Enteropeptidase
Ligand
BDBM158079
Substrate
Meas. Tech.
Inhibition Assay
pH
8±n/a
Ki
0.41±n/a nM
Comments
extracted
Citation
 Koshiba, TTokumasu, MIchimaru, TOhsumi, KNakagawa, TYamada, TMatsumoto, KSuzuki, T Heteroarylcarboxylic acid ester derivative US Patent  US9024044 Publication Date 5/5/2015 
Target
Name:
Enteropeptidase
Synonyms:
ENTK PRSS7 | TMPRSS15
Type:
Enzyme
Mol. Mass.:
112901.62
Organism:
Homo sapiens (Human)
Description:
P98073
Residue:
1019
  
Inhibitor
Name:
BDBM158079
Synonyms:
US9024044, 7 US9655879, 7
Type:
Small organic molecule
Emp. Form.:
C20H22FN3O5S
Mol. Mass.:
435.469
SMILES:
CN(CC(O)=O)C(=O)C(C)(C)Cc1ccc(s1)C(=O)Oc1ccc(cc1F)C(N)=N
: