Target
Enteropeptidase
Ligand
BDBM158083
Substrate
Meas. Tech.
Inhibition Assay
pH
8±n/a
Ki
0.41±n/a nM
Comments
extracted
Citation
 Koshiba, TTokumasu, MIchimaru, TOhsumi, KNakagawa, TYamada, TMatsumoto, KSuzuki, T Heteroarylcarboxylic acid ester derivative US Patent  US9024044 Publication Date 5/5/2015 
Target
Name:
Enteropeptidase
Synonyms:
ENTK PRSS7 | TMPRSS15
Type:
Enzyme
Mol. Mass.:
112901.62
Organism:
Homo sapiens (Human)
Description:
P98073
Residue:
1019
  
Inhibitor
Name:
BDBM158083
Synonyms:
US9024044, 11 | US9227949, 11
Type:
Small organic molecule
Emp. Form.:
C22H26FN3O6S
Mol. Mass.:
479.522
SMILES:
CCC(CC)(Cc1ccc(s1)C(=O)Oc1ccc(cc1F)C(N)=N)C(=O)N[C@@H](CO)C(O)=O
: