Target
Enteropeptidase
Ligand
BDBM158091
Substrate
Meas. Tech.
Inhibition Assay
pH
8±n/a
Ki
0.33±n/a nM
Comments
extracted
Citation
 Koshiba, TTokumasu, MIchimaru, TOhsumi, KNakagawa, TYamada, TMatsumoto, KSuzuki, T Heteroarylcarboxylic acid ester derivative US Patent  US9024044 Publication Date 5/5/2015 
Target
Name:
Enteropeptidase
Synonyms:
ENTK PRSS7 | TMPRSS15
Type:
Enzyme
Mol. Mass.:
112901.62
Organism:
Homo sapiens (Human)
Description:
P98073
Residue:
1019
  
Inhibitor
Name:
BDBM158091
Synonyms:
US9024044, 19 | US9227949, 19
Type:
Small organic molecule
Emp. Form.:
C23H26FN3O7S
Mol. Mass.:
507.532
SMILES:
CCC(CC)(Cc1ccc(s1)C(=O)Oc1ccc(cc1F)C(N)=N)C(=O)N[C@@H](CC(O)=O)C(O)=O
: