Target
Enteropeptidase
Ligand
BDBM158137
Substrate
Meas. Tech.
Inhibition Assay
pH
8±n/a
Ki
0.53±n/a nM
Comments
extracted
Citation
 Koshiba, TTokumasu, MIchimaru, TOhsumi, KNakagawa, TYamada, TMatsumoto, KSuzuki, T Heteroarylcarboxylic acid ester derivative US Patent  US9024044 Publication Date 5/5/2015 
Target
Name:
Enteropeptidase
Synonyms:
ENTK PRSS7 | TMPRSS15
Type:
Enzyme
Mol. Mass.:
112901.62
Organism:
Homo sapiens (Human)
Description:
P98073
Residue:
1019
  
Inhibitor
Name:
BDBM158137
Synonyms:
BDBM308529 US9227949, 65
Type:
Small organic molecule
Emp. Form.:
C19H20FN7O3S
Mol. Mass.:
445.471
SMILES:
CC(C)(Cc1ccc(s1)C(=O)Oc1ccc(cc1F)C(N)=N)C(=O)NCc1nnn[nH]1
: