Target
Enteropeptidase
Ligand
BDBM158140
Substrate
Meas. Tech.
Inhibition Assay
pH
8±n/a
Ki
0.24±n/a nM
Comments
extracted
Citation
 Koshiba, TTokumasu, MIchimaru, TOhsumi, KNakagawa, TYamada, TMatsumoto, KSuzuki, T Heteroarylcarboxylic acid ester derivative US Patent  US9024044 Publication Date 5/5/2015 
Target
Name:
Enteropeptidase
Synonyms:
ENTK PRSS7 | TMPRSS15
Type:
Enzyme
Mol. Mass.:
112901.62
Organism:
Homo sapiens (Human)
Description:
P98073
Residue:
1019
  
Inhibitor
Name:
BDBM158140
Synonyms:
US9024044, 68 US9655879, 68
Type:
Small organic molecule
Emp. Form.:
C25H22FN3O7S
Mol. Mass.:
527.521
SMILES:
CC(C)(Cc1ccc(s1)C(=O)Oc1ccc(cc1F)C(N)=N)C(=O)Nc1ccc(C(O)=O)c(c1)C(O)=O
: