Target
P2X purinoceptor 7
Ligand
BDBM160075
Substrate
Meas. Tech.
Radioligand Binding Assay
Ki
1.1±n/a nM
Citation
 Ameriks, MKRech, JCSavall, BM [1,2,4]triazolo[4,3-a]pyrazines as P2X7 modulators US Patent  US9040534 Publication Date 5/26/2015 
Target
Name:
P2X purinoceptor 7
Synonyms:
ATP receptor P2X purinoceptor 7 P2X purinoceptor 7 (P2X7) P2X7 rat P2rx7 | Purinergic receptor
Type:
Protein
Mol. Mass.:
68403.50
Organism:
Rattus norvegicus (Rat)
Description:
Q64663
Residue:
595
  
Inhibitor
Name:
BDBM160075
Synonyms:
US10047092, 16 | US9040534, 16
Type:
Small organic molecule
Emp. Form.:
C18H14ClF3N6O
Mol. Mass.:
422.792
SMILES:
C[C@H]1Cn2c(nnc2-c2cnccn2)C(=O)N1Cc1cccc(c1Cl)C(F)(F)F
: