Target
Cyclin-dependent kinase 2
Ligand
BDBM164883
Substrate
Meas. Tech.
In Vitro Kinase Inhibition Assay
pH
7.5±n/a
IC50
168±n/a nM
Comments
extracted
Citation
 Zeitlmann, LNiestroj, AHeiser, U Inhibitors of protein kinases US Patent  US9067888 Publication Date 6/30/2015 
Target
Name:
Cyclin-dependent kinase 2
Synonyms:
CDK2 CDK2_HUMAN Cell division protein kinase 2 Protein cereblon/Cyclin-dependent kinase 2 | p33 protein kinase
Type:
Enzyme Subunit
Mol. Mass.:
33938.17
Organism:
Homo sapiens (Human)
Description:
P24941
Residue:
298
  
Inhibitor
Name:
BDBM164883
Synonyms:
US9067888, 33
Type:
Small organic molecule
Emp. Form.:
C21H24FN3O3
Mol. Mass.:
385.432
SMILES:
COc1cc(F)ccc1-c1ccnc(NC(=O)[C@H]2CCC[C@H](C2)NC(C)=O)c1
: