Target
Glycogen synthase kinase-3 alpha
Ligand
BDBM164883
Substrate
Meas. Tech.
In Vitro Kinase Inhibition Assay
pH
7.5±n/a
IC50
160±n/a nM
Comments
extracted
Citation
 Zeitlmann, LNiestroj, AHeiser, U Inhibitors of protein kinases US Patent  US9067888 Publication Date 6/30/2015 
Target
Name:
Glycogen synthase kinase-3 alpha
Synonyms:
GSK-3 alpha GSK3A_HUMAN Glycogen synthase kinase-3 Glycogen synthase kinase-3 alpha (GSK3 Alpha) Glycogen synthase kinase-3 alpha (GSK3alpha)
Type:
Enzyme
Mol. Mass.:
50991.79
Organism:
Homo sapiens (Human)
Description:
P49840
Residue:
483
  
Inhibitor
Name:
BDBM164883
Synonyms:
US9067888, 33
Type:
Small organic molecule
Emp. Form.:
C21H24FN3O3
Mol. Mass.:
385.432
SMILES:
COc1cc(F)ccc1-c1ccnc(NC(=O)[C@H]2CCC[C@H](C2)NC(C)=O)c1
: