Target
Maternal embryonic leucine zipper kinase
Ligand
BDBM166127
Substrate
Meas. Tech.
Kinase Assay
pH
7.4±n/a
Temperature
298.15±n/a K
IC50
0.5±n/a nM
Comments
extracted
Citation
 Matsuo, YHisada, SNakamura, YAhmed, FWalker, JRHuntley, R 1,5-naphthyridine derivatives and MELK inhibitors containing the same US Patent  US9067937 Publication Date 6/30/2015 
Target
Name:
Maternal embryonic leucine zipper kinase
Synonyms:
KIAA0175 MELK_HUMAN Maternal embryonic leucine zipper kinase (MELK)
Type:
Enzyme
Mol. Mass.:
74665.45
Organism:
Homo sapiens (Human)
Description:
Q14680
Residue:
651
  
Inhibitor
Name:
BDBM166127
Synonyms:
US9067937, 71
Type:
Small organic molecule
Emp. Form.:
C26H24Cl2N6O2
Mol. Mass.:
523.414
SMILES:
CC(=O)c1cnc2ccc(nc2c1Nc1ccc(nc1)N1CCC[C@H](N)C1)-c1cc(Cl)c(O)c(Cl)c1
: