Target
Poly [ADP-ribose] polymerase 1
Ligand
BDBM167409
Substrate
Meas. Tech.
Displacement Assay
Kd
50±n/a nM
Citation
 Papeo, GMBorghi, DCaruso, MPosteri, HKrasavin, MY 3-Oxo-2,3-dihydro-1H-indazole-4-carboxamide derivatives as PARP-1 inhibitors US Patent  US9073893 Publication Date 7/7/2015 
Target
Name:
Poly [ADP-ribose] polymerase 1
Synonyms:
(ARTD1 or PARP1) 2.4.2.30 ADPRT ARTD1 Human diphtheria toxin-like ADP-ribosyltransferase (ARTD1 or PARP1) NT-PARP-1 PARP1 PPOL Poly [ADP-ribose] polymerase 1 (PARP) Poly [ADP-ribose] polymerase 1 (PARP1) Poly [ADP-ribose] polymerase 1, 28-kDa form Poly [ADP-ribose] polymerase 1, processed C-terminus Poly [ADP-ribose] polymerase-1 Poly(ADP-ribose) polymerase-1 (ARTD1/PARP1) Protein poly-ADP-ribosyltransferase PARP1 | Synonyms=ADPRT
Type:
Mol. Mass.:
113114.22
Organism:
Homo sapiens (Human)
Description:
P09874
Residue:
1014
  
Inhibitor
Name:
BDBM167409
Synonyms:
US9073893, 2
Type:
Small organic molecule
Emp. Form.:
C18H24N4O2
Mol. Mass.:
328.4088
SMILES:
NC(=O)c1cccc2[nH]n(C3CCN(CC3)C3CCCC3)c(=O)c12
: