Target
P2X purinoceptor 7
Ligand
BDBM173348
Substrate
Meas. Tech.
Radioligand Binding Assay
Ki
50.1±n/a nM
Citation
 Alcazar Vaca, MJAndres Gil, JILetavic, MARudolph, DAShireman, BTStenne, BMZiff, JM P2X7 modulators US Patent  US9096596 Publication Date 8/4/2015 
Target
Name:
P2X purinoceptor 7
Synonyms:
ATP receptor P2RX7_HUMAN P2X purinoceptor 7 (P2X7) P2Z receptor | Purinergic receptor
Type:
Protein
Mol. Mass.:
68602.85
Organism:
Homo sapiens (Human)
Description:
Q99572
Residue:
595
  
Inhibitor
Name:
BDBM173348
Synonyms:
US10323032, Example 66 US9604982, Example 66
Type:
Small organic molecule
Emp. Form.:
C20H16ClF4N5O
Mol. Mass.:
453.821
SMILES:
C[C@@H]1Cc2c(CN1C(=O)c1ccc(F)c(c1Cl)C(F)(F)F)nc(C)nc2-c1ccn[nH]1
: