Target
Fatty-acid amide hydrolase 1 [30-579]
Ligand
BDBM60536
Substrate
Meas. Tech.
Enzyme Assay
Temperature
310.15±n/a K
Ki
39±n/a nM
IC50
165±n/a nM
Comments
extracted
Citation
 Makriyannis, ANikas, SPAlapafuja, SOShukla, VG Fatty acid amide hydrolase inhibitors US Patent  US9102622 Publication Date 8/11/2015 
Target
Name:
Fatty-acid amide hydrolase 1 [30-579]
Synonyms:
Anandamide amidohydrolase 1 Faah Fatty Acid Amide Hydrolase Fatty-acid amide hydrolase (FAAH) Fatty-acid amide hydrolase 1 (FAAH) Oleamide hydrolase 1
Type:
Single-pass membrane protein; homodimer
Mol. Mass.:
60474.00
Organism:
Rattus norvegicus (rat)
Description:
P97612 (aa 30-579)
Residue:
550
  
Inhibitor
Name:
BDBM60536
Synonyms:
BDBM50399283 | US9102622, 13.2
Type:
Emp. Form.:
C20H25FO3S
Mol. Mass.:
364.474
SMILES:
FS(=O)(=O)CCCCCCCc1cccc(OCc2ccccc2)c1
: