Target
Fatty-acid amide hydrolase 1 [30-579]
Ligand
BDBM173952
Substrate
Meas. Tech.
Enzyme Assay
Temperature
310.15±n/a K
Ki
1700±n/a nM
IC50
14900±n/a nM
Comments
extracted
Citation
 Makriyannis, ANikas, SPAlapafuja, SOShukla, VG Fatty acid amide hydrolase inhibitors US Patent  US9102622 Publication Date 8/11/2015 
Target
Name:
Fatty-acid amide hydrolase 1 [30-579]
Synonyms:
Anandamide amidohydrolase 1 Faah Fatty Acid Amide Hydrolase Fatty-acid amide hydrolase (FAAH) Fatty-acid amide hydrolase 1 (FAAH) Oleamide hydrolase 1
Type:
Single-pass membrane protein; homodimer
Mol. Mass.:
60474.00
Organism:
Rattus norvegicus (rat)
Description:
P97612 (aa 30-579)
Residue:
550
  
Inhibitor
Name:
BDBM173952
Synonyms:
US9102622, 24.1
Type:
Small organic molecule
Emp. Form.:
C11H11F3O3
Mol. Mass.:
248.1984
SMILES:
Oc1ccc(OCCCC(=O)C(F)(F)F)cc1
: