Target
P2X purinoceptor 7
Ligand
BDBM174777
Substrate
Meas. Tech.
Radioligand Binding
Ki
1.3±n/a nM
Citation
 Letavic, MARudolph, DA 5,6,7,8,9,10-hexahydro-6,10-epimino[1,2,4]triazolo[4,3-a]azocines as P2X7 modulators US Patent  US9102686 Publication Date 8/11/2015 
Target
Name:
P2X purinoceptor 7
Synonyms:
ATP receptor P2X purinoceptor 7 P2X purinoceptor 7 (P2X7) P2X7 rat P2rx7 | Purinergic receptor
Type:
Protein
Mol. Mass.:
68403.50
Organism:
Rattus norvegicus (Rat)
Description:
Q64663
Residue:
595
  
Inhibitor
Name:
BDBM174777
Synonyms:
US10053462, 8 US9540388, 8
Type:
Small organic molecule
Emp. Form.:
C19H15ClF3N5OS
Mol. Mass.:
453.869
SMILES:
FC(F)(F)c1cccc(C(=O)N2[C@H]3CCC[C@@H]2c2nnc(-c4cscn4)n2C3)c1Cl
: