Target
Plasminogen activator inhibitor 1
Ligand
BDBM92483
Substrate
Meas. Tech.
Surface Plasmon Resonance (SPR) Assay
pH
5±n/a
Temperature
296.15±n/a K
Kd
67±3 nM
Comments
extracted
Citation
 Lawrence, DAEmal, CCale, JSu, EJWarnock, MLi, SCupp, JA Plasminogen activator inhibitor-1 inhibitors and methods of use thereof to modulate lipid metabolism US Patent  US9120744 Publication Date 9/1/2015 
Target
Name:
Plasminogen activator inhibitor 1
Synonyms:
Endothelial plasminogen activator inhibitor PAI-1 PAI1_HUMAN Plasminogen activator inhibitor 1 Plasminogen activator inhibitor-1 SERPINE1
Type:
Enzyme
Mol. Mass.:
45064.00
Organism:
Homo sapiens (Human)
Description:
P05121
Residue:
402
  
Inhibitor
Name:
BDBM92483
Synonyms:
CDE-034 | US9120744, CDE-034
Type:
Small organic molecule
Emp. Form.:
C20H20O10
Mol. Mass.:
420.3668
SMILES:
Oc1cc(cc(O)c1O)C(=O)O[C@@H]1CCCC[C@H]1OC(=O)c1cc(O)c(O)c(O)c1
: