Target
Maternal embryonic leucine zipper kinase
Ligand
BDBM177269
Substrate
Meas. Tech.
Kinase Assay
pH
7.4±n/a
Temperature
298.15±n/a K
IC50
0.74±n/a nM
Comments
extracted
Citation
 Matsuo, YHisada, SNakamura, YAhmed, FHuntley, RWalker, JRDecornez, H Quinoline derivatives and MELK inhibitors containing the same US Patent  US9120749 Publication Date 9/1/2015 
Target
Name:
Maternal embryonic leucine zipper kinase
Synonyms:
KIAA0175 MELK_HUMAN Maternal embryonic leucine zipper kinase (MELK)
Type:
Enzyme
Mol. Mass.:
74665.45
Organism:
Homo sapiens (Human)
Description:
Q14680
Residue:
651
  
Inhibitor
Name:
BDBM177269
Synonyms:
US9120749, 635
Type:
Small organic molecule
Emp. Form.:
C29H33Cl2N3O3
Mol. Mass.:
542.497
SMILES:
CN(CCO)C[C@H]1CC[C@@H](CC1)Nc1c(cnc2ccc(cc12)-c1cc(Cl)c(O)c(Cl)c1)C(=O)C1CC1
: