Target
Pantothenate kinase
Ligand
BDBM188494
Substrate
Meas. Tech.
Biochemical Assay (ATP at 50x Km)
IC50
1.40e+4±n/a nM
Citation
 Björkelid, CBergfors, TRaichurkar, AKMukherjee, KMalolanarasimhan, KBandodkar, BJones, TA Structural and biochemical characterization of compounds inhibiting Mycobacterium tuberculosis pantothenate kinase. J Biol Chem 288:18260-70 (2013)  
Target
Name:
Pantothenate kinase
Synonyms:
COAA_MYCTU coaA
Type:
Protein
Mol. Mass.:
35661.98
Organism:
Mycobacterium tuberculosis ATCC 25618/H37Rv
Description:
Residue:
312
  
Inhibitor
Name:
BDBM188494
Synonyms:
Triazole 1f
Type:
Small organic molecule
Emp. Form.:
C20H19F3N4O2S
Mol. Mass.:
436.451
SMILES:
CC(NC(=O)c1c(F)cccc1F)c1nnc(SCCOc2ccc(F)cc2)n1C
: