Target
Tyrosyl-DNA phosphodiesterase 2
Ligand
BDBM50438870
Substrate
Meas. Tech.
Recombinant TDP2 Assay
pH
7.5±n/a
IC50
3.9e+3± 7e+2 nM
Comments
extracted
Citation
 Marchand, CAbdelmalak, MKankanala, JHuang, SYKiselev, EFesen, KKurahashi, KSasanuma, HTakeda, SAihara, HWang, ZPommier, Y Deazaflavin Inhibitors of Tyrosyl-DNA Phosphodiesterase 2 (TDP2) Specific for the Human Enzyme and Active against Cellular TDP2. ACS Chem Biol 11:1925-33 (2016)  
Target
Name:
Tyrosyl-DNA phosphodiesterase 2
Synonyms:
EAP2 ETS1-associated protein 2 TDP2 TTRAP Tyr-DNA phosphodiesterase 2 Tyrosyl-DNA phosphodiesterase 2 (hTDP2) VPg unlinkase | hTDP2
Type:
Enzyme Catalytic Domain
Mol. Mass.:
40916.54
Organism:
Homo sapiens (Human)
Description:
gi_23510348
Residue:
362
  
Inhibitor
Name:
BDBM50438870
Synonyms:
8-Chloro-10-(4-hydroxyphenyl)pyrimido[4,5-b]quinoline-2,4-dione (4) | CHEMBL2420501
Type:
Small organic molecule
Emp. Form.:
C17H10ClN3O3
Mol. Mass.:
339.733
SMILES:
Oc1ccc(cc1)-n1c2cc(Cl)ccc2cc2c1nc(=O)[nH]c2=O
: