Target
Tyrosyl-DNA phosphodiesterase 2 [Q278R,I281T,K282R,P318T,Y321C]
Ligand
BDBM188529
Substrate
Meas. Tech.
Recombinant TDP2 Assay
pH
7.5±n/a
IC50
1.2e+3± 1e+2 nM
Comments
extracted
Citation
 Marchand, CAbdelmalak, MKankanala, JHuang, SYKiselev, EFesen, KKurahashi, KSasanuma, HTakeda, SAihara, HWang, ZPommier, Y Deazaflavin Inhibitors of Tyrosyl-DNA Phosphodiesterase 2 (TDP2) Specific for the Human Enzyme and Active against Cellular TDP2. ACS Chem Biol 11:1925-33 (2016)  
Target
Name:
Tyrosyl-DNA phosphodiesterase 2 [Q278R,I281T,K282R,P318T,Y321C]
Synonyms:
TYDP2_MOUSE Ttrap | Tyrosyl-DNA phosphodiesterase 2 mutant 5M (mTDP2 5M)
Type:
Protein
Mol. Mass.:
41016.00
Organism:
Mus musculus (Mouse)
Description:
The mTDP2 5M protein bears the five human mutations Q278R, I281T, K282R, P318T, and Y321C.
Residue:
370
  
Inhibitor
Name:
BDBM188529
Synonyms:
2,4-Dioxo-10-[3-(1H-tetrazol-5-yl)phenyl]pyrimido[4,5-b]-quinoline-8-carbonitrile (1)
Type:
Small organic molecule
Emp. Form.:
C19H10N8O2
Mol. Mass.:
382.3351
SMILES:
O=c1nc2n(-c3cccc(c3)-n3cnnn3)c3cc(ccc3cc2c(=O)[nH]1)C#N
: