Target
Tyrosyl-DNA phosphodiesterase 2 [E242G,S244A,Q278R,I281T,K282R,R316G,P318T,Y321CH323L]
Ligand
BDBM50438870
Substrate
Meas. Tech.
Recombinant TDP2 Assay
pH
7.5±n/a
IC50
4e+3±n/a nM
Comments
extracted
Citation
 Marchand, CAbdelmalak, MKankanala, JHuang, SYKiselev, EFesen, KKurahashi, KSasanuma, HTakeda, SAihara, HWang, ZPommier, Y Deazaflavin Inhibitors of Tyrosyl-DNA Phosphodiesterase 2 (TDP2) Specific for the Human Enzyme and Active against Cellular TDP2. ACS Chem Biol 11:1925-33 (2016)  
Target
Name:
Tyrosyl-DNA phosphodiesterase 2 [E242G,S244A,Q278R,I281T,K282R,R316G,P318T,Y321CH323L]
Synonyms:
TYDP2_MOUSE Ttrap | Tyrosyl-DNA phosphodiesterase 2 mutant 9M(mTDP2 9M)
Type:
Protein
Mol. Mass.:
40804.32
Organism:
Mus musculus (Mouse)
Description:
The mTDP2 9M bears the mutations at residues Q278R, I281T, K282R, P318T, Y321C, E242G, S244A, R316G, and H323L.
Residue:
370
  
Inhibitor
Name:
BDBM50438870
Synonyms:
8-Chloro-10-(4-hydroxyphenyl)pyrimido[4,5-b]quinoline-2,4-dione (4) | CHEMBL2420501
Type:
Small organic molecule
Emp. Form.:
C17H10ClN3O3
Mol. Mass.:
339.733
SMILES:
Oc1ccc(cc1)-n1c2cc(Cl)ccc2cc2c1nc(=O)[nH]c2=O
: