Target
Glutaminyl-peptide cyclotransferase-like protein
Ligand
BDBM190690
Substrate
Meas. Tech.
Spectrophotometric Assay
Temperature
303.15±n/a K
Ki
10±n/a nM
IC50
80±n/a nM
Comments
extracted
Citation
 Heiser, URamsbeck, DHoffmann, TBoehme, LDemuth, H Inhibitors of glutaminyl cyclase US Patent  US9181233 Publication Date 11/10/2015 
Target
Name:
Glutaminyl-peptide cyclotransferase-like protein
Synonyms:
Glutaminyl Cyclase QPCTL | QPCTL_HUMAN
Type:
Protein
Mol. Mass.:
42941.16
Organism:
Homo sapiens (Human)
Description:
Q9NXS2
Residue:
382
  
Inhibitor
Name:
BDBM190690
Synonyms:
US9181233, 67
Type:
Small organic molecule
Emp. Form.:
C18H16N4O2S2
Mol. Mass.:
384.475
SMILES:
COc1ccc(SCc2nnc(s2)-c2ccc3[nH]cnc3c2)cc1OC
: