Target
5'-AMP-activated protein kinase catalytic subunit alpha-1
Ligand
BDBM192511
Substrate
Meas. Tech.
AMPK Activation Assay
pH
7±n/a
EC50
468±n/a nM
Citation
 Wagner, HHimmelsbach, F Azabenzimidazole derivatives US Patent  US9187477 Publication Date 11/17/2015 
Target
Name:
5'-AMP-activated protein kinase catalytic subunit alpha-1
Synonyms:
AAPK1_HUMAN AMP-activated protein kinase alpha-1/beta-2/gamma-2 AMPK subunit alpha-1 AMPK1 PRKAA1 | Tau-protein kinase PRKAA1
Type:
Protein
Mol. Mass.:
64023.62
Organism:
Homo sapiens (Human)
Description:
Q13131
Residue:
559
  
Inhibitor
Name:
BDBM192511
Synonyms:
US9187477, 7
Type:
Small organic molecule
Emp. Form.:
C27H31ClN4O6
Mol. Mass.:
543.011
SMILES:
CCNC(=O)O[C@H]1CC[C@@H](CC1)c1ccc(cc1)-c1nc2[nH]c(O[C@@H]3COC4[C@H](O)COC34)nc2cc1Cl
: