Target
Aldo-keto reductase family 1 member A1
Ligand
BDBM193852
Substrate
Meas. Tech.
ALR1 in vitro Inhibition Assay
pH
6.2±n/a
IC50
1.71e+3± 1e+1 nM
Comments
extracted
Citation
 Ibrar, ATehseen, YKhan, IHameed, ASaeed, AFurtmann, NBajorath, JIqbal, J Coumarin-thiazole and -oxadiazole derivatives: Synthesis, bioactivity and docking studies for aldose/aldehyde reductase inhibitors. Bioorg Chem 68:177-186 (2016)  
Target
Name:
Aldo-keto reductase family 1 member A1
Synonyms:
AK1A1_BOVIN Aldehyde reductase (ALR1)
Type:
Protein
Mol. Mass.:
36620.67
Organism:
Bos taurus (Cattle)
Description:
Residue:
325
  
Inhibitor
Name:
BDBM193852
Synonyms:
(E)-3-(2-(2-(1-(4-bromophenyl)ethylidene)hydrazinyl)thiazol-4-yl)-2H-chromen-2-one (6e)
Type:
Small organic molecule
Emp. Form.:
C20H14BrN3O2S
Mol. Mass.:
440.313
SMILES:
C\C(=N/Nc1nc(cs1)-c1cc2ccccc2oc1=O)c1ccc(Br)cc1
: